{"text_format":"1","workbook":"xlsx","n_sheets":15,"sheets":["1. Instructions and Notations","2. Census Data","3. Single-family","4. Multi-family","5. ICI & Other Metered","6. Reuse","7. Total Diverted","8. Reported Data","9. Annual Performance","10. Monthly Performance","11. Definition","Sheet4","Sheet2","Sheet3","Sheet1"],"not_rendered":{"charts":7,"images":8,"macros":1,"external_links":0,"defined_names":9,"comments":5,"pivot_tables":0},"unopened":[],"bounds":{"document_bytes":16777216,"sheet_cells":100000,"rows_first":2000,"rows_last":500,"rows_between":2000,"halvings":0,"cell_chars":16384,"cell_head_chars":4096},"cells_cut":0,"cells_raw":0,"read":"whole","date_system":"1900"}

{"sheet":"1. Instructions and Notations","index":0,"n_rows":65,"n_cols":11,"rows_kept":65,"cut":false,"hidden":false,"merged":[[62,3,62,12],[46,3,46,12],[32,11,32,12],[32,9,32,10],[60,3,60,12],[58,3,58,12],[56,3,56,12],[54,3,54,12],[37,4,37,5],[48,3,48,12],[52,3,52,12],[50,3,50,12],[1,1,8,13],[44,3,44,12],[42,3,42,12],[40,3,40,12],[15,2,15,12],[10,2,11,12],[27,8,27,11],[32,5,32,8],[18,2,22,2],[12,2,12,12],[27,3,27,5]]}
[]
[null,"Gallons per Capita - v2.07"]
[]
[]
[]
[]
[]
[]
[]
[]
{"$rows_left_out":56}
{"sheet":"2. Census Data","index":1,"n_rows":24,"n_cols":7,"rows_kept":24,"cut":false,"hidden":false,"merged":[[1,3,1,6],[2,3,2,6],[24,0,28,7]]}
["Census Information Data Table 2.1"]
[null,null,null,""]
[]
[null,null,null,{"$f":"'1. Instructions and Notations'!E31","v":0},"TO",{"$f":"'1. Instructions and Notations'!I31","v":""},{"$f":"'1. Instructions and Notations'!#REF!","v":{"$error":"#REF!"}}]
[null,null,"               OR","Use the most recent census data"]
[]
[]
[]
[null,"DATA"]
[null,"US Census Table","Description",null,"INPUT"]
{"$rows_left_out":15}
{"sheet":"3. Single-family","index":2,"n_rows":87,"n_cols":34,"rows_kept":87,"cut":false,"hidden":false,"merged":[[64,18,64,19],[2,5,4,11],[24,19,25,19],[23,4,23,5],[10,16,10,20],[10,0,10,14],[13,17,14,17],[1,1,2,2],[24,1,24,3],[70,1,73,13],[35,33,36,33],[13,19,14,19],[20,33,21,33],[24,17,25,17],[46,19,47,19],[46,17,47,17],[35,17,36,17],[35,19,36,19],[59,18,60,19],[65,18,65,19],[66,18,66,19],[67,18,67,19],[61,18,61,19],[62,18,62,19],[63,18,63,19]]}
[]
[null,"DATA INPUT SHEET"]
[null,null,null,null,null,"3. SINGLE-FAMILY RESIDENTIAL (SFR)",null,null,null,null,null,null,null,null,null,null,null,null,null,null,null,null,null,null,null,null,null,null,null,null,null,{"$f":"IF(E24=\"Total Connections\",1,0)","v":0}]
[null,null,null,null,null,null,null,null,null,null,null,null,null,null,null,null,null,null,null,null,null,null,null,null,null,null,null,null,null,null,null,"0 = Active Connections"]
[null,null,{"$f":"IF(ISBLANK('1. Instructions and Notations'!$D$28),\"\",'1. Instructions and Notations'!$D$28)","v":""}]
[null,"Instructions"]
[]
[]
[]
[null,null,null,null,null,null,null,null,null,null,null,null,null,null,null,null,null,null,null,null,null,null,null,null,null,null,null,null,null,null,null,"1 = Total Connections"]
{"$rows_left_out":78}
{"sheet":"4. Multi-family","index":3,"n_rows":58,"n_cols":24,"rows_kept":58,"cut":false,"hidden":false,"merged":[[1,5,3,11],[32,17,33,17],[6,16,6,20],[6,0,6,14],[47,18,47,19],[20,19,21,19],[20,17,21,17],[1,1,2,2],[9,1,9,4],[51,18,51,19],[9,17,10,17],[9,19,10,19],[45,18,46,19],[56,1,59,13],[32,19,33,19],[52,18,52,19],[53,18,53,19],[48,18,48,19],[49,18,49,19],[50,18,50,19]]}
[]
[null,"DATA INPUT SHEET",null,null,null,"4. MULTI-FAMILY RESIDENTIAL (MFR)"]
[]
[null,null,{"$f":"IF(ISBLANK('1. Instructions and Notations'!$D$28),\"\",'1. Instructions and Notations'!$D$28)","v":""}]
[]
[null,"Instructions"]
["MONTHLY DATA",null,null,null,null,null,null,null,null,null,null,null,null,null,null,null,"ANNUAL DATA"]
[null,null,null,null,null,null,null,null,null,null,null,{"$f":"'1. Instructions and Notations'!E31","v":0},"TO",{"$f":"'1. Instructions and Notations'!I31","v":""}]
[null,"TABLE 4.1",null,null,{"$f":"IF('1. Instructions and Notations'!$E$38=\"Choose units...\",\"        First select reporting units for volume data on the instructions worksheet\",\"\")","v":"        First select reporting units for volume data on the instructions worksheet"},null,null,null,null,null,null,null,null,null,null,null,null,"TABLE 4.5",null,"TABLE 4.6"]
[null,{"$f":"\"MFR BILLED WATER CONSUMPTION (Monthly) (\"&'1. Instructions and Notations'!E38&\")\"","v":"MFR BILLED WATER CONSUMPTION (Monthly) (Choose units...)"},null,null,null,null,null,null,null,null,null,null,null,null,null,null,null,"ANNUAL CONSUMPTION",null,"ANNUAL CALCULATION"]
{"$rows_left_out":49}
{"sheet":"5. ICI & Other Metered","index":4,"n_rows":42,"n_cols":25,"rows_kept":42,"cut":false,"hidden":false,"merged":[[9,17,10,17],[9,19,10,19],[1,1,2,2],[32,1,35,13],[9,24,10,24],[21,24,22,24],[3,1,3,3],[5,16,5,20],[1,4,3,12],[21,17,22,17],[21,19,22,19],[5,6,6,8]]}
[]
[null,"DATA INPUT SHEET",null,null,"5. INDUSTRIAL, COMMERCIAL & INSTITUTIONAL (ICI) AND OTHER METERED "]
[]
[]
[null,null,{"$f":"IF(ISBLANK('1. Instructions and Notations'!$D$28),\"\",'1. Instructions and Notations'!$D$28)","v":""}]
[null,null,null,null,null,null,"MONTHLY DATA",null,null,null,null,null,null,null,null,null,"ANNUAL DATA"]
[null,"Instructions"]
[null,null,null,null,null,null,null,null,null,null,null,{"$f":"'1. Instructions and Notations'!E31","v":0},"TO",{"$f":"'1. Instructions and Notations'!I31","v":""}]
[null,"TABLE 5.1",null,null,{"$f":"IF('1. Instructions and Notations'!$E$38=\"Choose units...\",\"        First select reporting units for volume data on the instructions worksheet\",\"\")","v":"        First select reporting units for volume data on the instructions worksheet"},null,null,null,null,null,null,null,null,null,null,null,null,"TABLE 5.3",null,"TABLE 5.4",null,null,null,null,"TABLE 5.5"]
[null,{"$f":"\"ICI WATER CONSUMPTION (\"&'1. Instructions and Notations'!E38&\")\"","v":"ICI WATER CONSUMPTION (Choose units...)"},null,null,null,null,null,null,null,null,null,null,null,null,null,null,null,"ICI ANNUAL CONSUMPTION",null,"ICI GPCD ",null,null,null,null,"ICI ANNUAL CALCULATED"]
{"$rows_left_out":33}
{"sheet":"6. Reuse","index":5,"n_rows":31,"n_cols":25,"rows_kept":31,"cut":false,"hidden":false,"merged":[[31,1,34,13],[9,24,10,24],[3,1,3,3],[5,16,5,20],[1,4,3,12],[5,6,6,8],[9,17,10,17],[9,19,10,19],[1,1,2,2]]}
[]
[null,"DATA INPUT SHEET",null,null,"6. REUSE"]
[]
[]
[null,null,{"$f":"IF(ISBLANK('1. Instructions and Notations'!$D$28),\"\",'1. Instructions and Notations'!$D$28)","v":""}]
[null,null,null,null,null,null,"MONTHLY DATA",null,null,null,null,null,null,null,null,null,"ANNUAL DATA"]
[null,"Instructions"]
[null,null,null,null,null,null,null,null,null,null,null,{"$f":"'1. Instructions and Notations'!E31","v":0},"TO",{"$f":"'1. Instructions and Notations'!I31","v":""}]
[null,"TABLE 6.1",null,null,{"$f":"IF('1. Instructions and Notations'!$E$38=\"Choose units...\",\"        First select reporting units for volume data on the instructions worksheet\",\"\")","v":"        First select reporting units for volume data on the instructions worksheet"},null,null,null,null,null,null,null,null,null,null,null,null,"TABLE 6.2",null,"TABLE 6.3"]
[null,{"$f":"\"REUSE DIVERSIONS (Monthly) (\"&'1. Instructions and Notations'!E38&\")\"","v":"REUSE DIVERSIONS (Monthly) (Choose units...)"},null,null,null,null,null,null,null,null,null,null,null,null,null,null,null,"REUSE ANNUAL DIVERSIONS",null,"REUSE GPCD ",null,null,null,null,"Annual Reuse"]
{"$rows_left_out":22}
{"sheet":"7. Total Diverted","index":6,"n_rows":67,"n_cols":24,"rows_kept":67,"cut":false,"hidden":false,"merged":[[8,22,9,22],[20,17,21,17],[32,17,33,17],[56,18,57,18],[67,1,70,13],[56,19,57,19],[8,17,9,17],[44,19,45,19],[56,1,56,2],[20,1,20,3],[44,17,45,17],[20,19,21,19],[32,19,33,19],[32,1,32,3],[1,1,2,2],[8,1,8,3],[5,0,5,14],[1,5,3,11],[5,16,5,20],[8,19,9,19]]}
[]
[null,"DATA INPUT SHEET",null,null,null,"7. TOTAL WATER DIVERTED AND SUPPLIED"]
[]
[]
[null,null,{"$f":"IF(ISBLANK('1. Instructions and Notations'!$D$28),\"\",'1. Instructions and Notations'!$D$28)","v":""}]
["MONTHLY DATA",null,null,null,null,null,null,null,null,null,null,null,null,null,null,null,"ANNUAL DATA"]
[]
[null,"TABLE 7.1",null,null,{"$f":"IF('1. Instructions and Notations'!$E$38=\"Choose units...\",\"        First select reporting units for volume data on the instructions worksheet\",\"\")","v":"        First select reporting units for volume data on the instructions worksheet"},null,null,null,null,null,null,{"$f":"'1. Instructions and Notations'!E31","v":0},"TO",{"$f":"'1. Instructions and Notations'!I31","v":""},null,null,null,"TABLE 7.6",null,"TABLE 7.7",null,null,"TABLE 6.6"]
[null,{"$f":"\"TOTAL WATER DIVERTED (Monthly) (\"&'1. Instructions and Notations'!E38&\")\"","v":"TOTAL WATER DIVERTED (Monthly) (Choose units...)"},null,null,null,null,null,null,null,null,null,null,null,null,null,null,null,"ANNUAL TOTAL DIVERTED",null,"ANNUAL TOTAL DIVERTED CALC",null,null,"TOTAL POP. EST."]
[null,"Year","JAN","FEB","MAR","APR","MAY","JUN","JUL","AUG","SEP","OCT","NOV","DEC"]
{"$rows_left_out":58}
{"sheet":"8. Reported Data","index":7,"n_rows":83,"n_cols":13,"rows_kept":83,"cut":false,"hidden":false,"merged":[[1,10,1,12],[2,10,2,12],[1,1,1,7]]}
[]
[null,"8. SUMMARY GPCD REPORTED DATA",null,null,null,null,null,null,null,null,{"$f":"IF(ISBLANK('1. Instructions and Notations'!$D$28),\"\",'1. Instructions and Notations'!$D$28)","v":""},{"$f":"IF(ISBLANK('1. Instructions and Notations'!$D$28),\"\",'1. Instructions and Notations'!$D$28)","v":""},{"$f":"IF(ISBLANK('1. Instructions and Notations'!$D$28),\"\",'1. Instructions and Notations'!$D$28)","v":""}]
[]
[null,"ANNUAL",null,null,null,null,null,null,null,null,{"$f":"'1. Instructions and Notations'!E31","v":0},"To:",{"$f":"'1. Instructions and Notations'!I31","v":""}]
[]
[]
[]
[]
[]
[]
{"$rows_left_out":74}
{"sheet":"9. Annual Performance","index":8,"n_rows":20,"n_cols":27,"rows_kept":20,"cut":false,"hidden":false,"merged":[[19,5,19,7],[17,2,17,7],[18,2,18,7],[19,2,19,3]]}
[]
[null,"9. System Total Annual Reporting Performance"]
[]
[null,"Overall Annual GPCD (based on Total Population)"]
[]
[null,null,null,"SFR (System Total)","MFR (System Total)","ICI","Other Metered","Non-Revenue Water",null,"Total Supplied",null,{"$f":"\"Non-Revenue Volume \"&IF('1. Instructions and Notations'!E38=\"Choose units...\",\"\",IF('1. Instructions and Notations'!E38=\"Gallons (US)\",\"Million \",\"Thousand \")&'1. Instructions and Notations'!E38)","v":"Non-Revenue Volume "},null,null,null,null,null,null,{"$f":"D6","v":"SFR (System Total)"},{"$f":"E6","v":"MFR (System Total)"},{"$f":"F6","v":"ICI"},{"$f":"G6","v":"Other Metered"},{"$f":"#REF!","v":{"$error":"#REF!"}},{"$f":"H6","v":"Non-Revenue Water"}]
[null,null,"Year",null,null,null,null,null,null,null,null,null,null,null,null,null,null,{"$f":"C9","v":""},{"$f":"IF($D$8=\"Yes\",D9,\"Not Graphed\")","v":"N/A"},{"$f":"IF($E$8=\"Yes\",E9,\"Not Graphed\")","v":"N/A"},{"$f":"IF($F$8=\"Yes\",F9,\"Not Graphed\")","v":"N/A"},{"$f":"IF(G$8=\"Yes\",G9,\"Not Graphed\")","v":"N/A"},{"$f":"IF(#REF!=\"Yes\",#REF!,\"Not Graphed\")","v":{"$error":"#REF!"}},{"$f":"IF($H$8=\"Yes\",H9,\"Not Graphed\")","v":{"$error":"#VALUE!"}}]
[null,null,"On Graph?","Yes","Yes","Yes","Yes","Yes",null,null,null,null,null,null,null,null,null,"","N/A","N/A","N/A",{"$f":"IF($G$8=\"Yes\",G10,\"Not Graphed\")","v":"N/A"},{"$f":"IF(#REF!=\"Yes\",#REF!,\"Not Graphed\")","v":{"$error":"#REF!"}},{"$error":"#VALUE!"}]
[null,null,{"$f":"'3. Single-family'!B62","v":""},{"$f":"IF(OR('3. Single-family'!T16=\"N/A\",'7. Total Diverted'!W11=\"N/A\"),\"N/A\",'3. Single-family'!T16*IF('1. Instructions and Notations'!$E$38=\"Cubic Feet\",7.48051945,1)/('7. Total Diverted'!W11*365))","v":"N/A"},{"$f":"IF('4. Multi-family'!T12=\"N/A\",\"N/A\",'4. Multi-family'!T12*IF('1. Instructions and Notations'!$E$38=\"Cubic Feet\",7.48051945,1)/('7. Total Diverted'!W11*365))","v":"N/A"},{"$f":"'5. ICI & Other Metered'!T12","v":"N/A"},{"$f":"'5. ICI & Other Metered'!T24","v":"N/A"},{"$f":"IF('7. Total Diverted'!T59=\"N/A\",\"N/A\",'7. Total Diverted'!T59-SUM(D9:G9))","v":{"$error":"#VALUE!"}},null,{"$f":"SUM(D9:H9)","v":{"$error":"#VALUE!"}},null,{"$f":"IF('7. Total Diverted'!R47=\"N/A\",\"N/A\",('7. Total Diverted'!R47-IF('6. Reuse'!T12=\"N/A\",0,'6. Reuse'!T12)-IF('5. ICI & Other Metered'!Y12=\"N/A\",0,'5. ICI & Other Metered'!Y12)-IF('5. ICI & Other Metered'!Y24=\"N/A\",0,'5. ICI & Other Metered'!Y24)-IF('4. Multi-family'!T12=\"N/A\",0,'4. Multi-family'!T12)-IF('3. Single-family'!T16=\"N/A\",0,'3. Single-family'!T16))/IF('1. Instructions and Notations'!$E$38=\"Gallons (US)\",1000000,1000))","v":0},null,null,null,null,null,"","N/A","N/A","N/A","N/A",{"$f":"IF(#REF!=\"Yes\",#REF!,\"Not Graphed\")","v":{"$error":"#REF!"}},{"$error":"#VALUE!"}]
[null,null,{"$f":"'3. Single-family'!B63","v":""},{"$f":"IF(OR('3. Single-family'!T17=\"N/A\",'7. Total Diverted'!W12=\"N/A\"),\"N/A\",'3. Single-family'!T17/('7. Total Diverted'!W12*365))","v":"N/A"},{"$f":"IF('4. Multi-family'!T13=\"N/A\",\"N/A\",'4. Multi-family'!T13/('7. Total Diverted'!W12*365))","v":"N/A"},{"$f":"'5. ICI & Other Metered'!T13","v":"N/A"},{"$f":"'5. ICI & Other Metered'!T25","v":"N/A"},{"$f":"IF('7. Total Diverted'!T60=\"N/A\",\"N/A\",'7. Total Diverted'!T60-SUM(D10:G10))","v":{"$error":"#VALUE!"}},null,{"$f":"SUM(D10:H10)","v":{"$error":"#VALUE!"}},null,{"$f":"IF('7. Total Diverted'!R48=\"N/A\",\"N/A\",('7. Total Diverted'!R48-IF('6. Reuse'!T13=\"N/A\",0,'6. Reuse'!T13)-IF('5. ICI & Other Metered'!Y13=\"N/A\",0,'5. ICI & Other Metered'!Y13)-IF('5. ICI & Other Metered'!Y25=\"N/A\",0,'5. ICI & Other Metered'!Y25)-IF('4. Multi-family'!T13=\"N/A\",0,'4. Multi-family'!T13)-IF('3. Single-family'!T17=\"N/A\",0,'3. Single-family'!T17))/IF('1. Instructions and Notations'!$E$38=\"Gallons (US)\",1000000,1000))","v":0},null,null,null,null,null,"","N/A","N/A","N/A","N/A",{"$f":"IF(#REF!=\"Yes\",#REF!,\"Not Graphed\")","v":{"$error":"#REF!"}},{"$error":"#VALUE!"}]
{"$rows_left_out":11}
{"sheet":"10. Monthly Performance","index":9,"n_rows":28,"n_cols":26,"rows_kept":28,"cut":false,"hidden":false,"merged":[[27,4,27,5],[27,7,27,8],[3,2,3,6],[5,4,5,8],[25,4,25,8],[26,4,26,8]]}
[]
[null,"10. Monthly Reporting Performance"]
[]
[null,null,"Choose Year for Monthly Analysis",null,null,null,null,null,null,null,null,"↓"]
[]
[null,null,"Choose Sector",null,"Single-Family Residential"]
[null,"Monthly GPCD"]
[]
[null,null,null,null,"Single-Family Residential","Multi-Family Residential","ICI","Other Metered","Non-Revenue",null,null,"Total of Sectors",null,null,{"$f":"E9","v":"Single-Family Residential"},{"$f":"F9","v":"Multi-Family Residential"},{"$f":"G9","v":"ICI"},{"$f":"H9","v":"Other Metered"},{"$f":"#REF!","v":{"$error":"#REF!"}},{"$f":"I9","v":"Non-Revenue"}]
[null,null,null,"Month","GPCD","GPCD","GPCD","GPCD","GPCD",null,null,null,null,"January",{"$f":"IF($E$6=\"Single-Family Residential\",E12,\"\")","v":{"$error":"#N/A"}},{"$f":"IF($E$6=\"Multi-Family Residential\",F12,\"\")","v":""},{"$f":"IF($E$6=\"ICI\",G12,\"\")","v":""},{"$f":"IF($E$6=\"Other Metered\",H12,\"\")","v":""},{"$f":"IF($E$6=\"Reuse\",#REF!,\"\")","v":""},{"$f":"IF($E$6=\"Non-Revenue\",I12,\"\")","v":""},null,null,null,null,"Single-Family Residential",{"$f":"'3. Single-family'!B16","v":""}]
{"$rows_left_out":19}
{"sheet":"11. Definition","index":10,"n_rows":101,"n_cols":10,"rows_kept":101,"cut":false,"hidden":false,"merged":[[96,2,96,9],[59,4,59,11],[20,4,20,5],[5,4,5,11],[17,4,17,11],[29,4,29,11],[25,4,25,11],[27,4,27,11],[31,4,31,11],[33,4,33,11],[39,4,39,11],[43,4,43,11],[35,4,35,11],[41,4,41,11],[37,4,37,11],[23,4,23,11],[57,4,57,11],[45,4,45,11],[51,4,51,11],[53,4,53,11],[47,4,47,11],[55,4,55,11],[49,4,49,11],[21,4,21,11],[20,10,20,11],[1,2,1,8],[3,4,3,11],[7,4,7,11],[11,4,11,11],[19,4,19,11],[9,4,9,11],[13,4,13,11],[15,4,15,11]]}
[]
[null,null," NMOSE GPCD Software: Definitions"]
[]
[null,null,"Item Name",null,"Description"]
[]
[null,null,"Active Connections",null,"All active Single Family Residential connections within the utility.  Connections that are not occupied or show zero activity are not counted in this category.  "]
[]
[null,null,"Annual Multi-Family Residential GPCD Calculation",null,"The MFR  GPCD is Annual MF Calculation (4.6) divided by the annual MFR Population (4.9). "]
[]
[null,null,"Annual Single Family Residential GPCD Calculation",null,"The SFR GPCD is Annual SFR Calculation (3.7) divided by the annual SFR Population average (3.13)."]
{"$rows_left_out":92}
{"sheet":"Sheet4","index":11,"n_rows":0,"n_cols":0,"rows_kept":0,"cut":false,"hidden":false,"merged":[]}

{"sheet":"Sheet2","index":12,"n_rows":0,"n_cols":0,"rows_kept":0,"cut":false,"hidden":false,"merged":[]}

{"sheet":"Sheet3","index":13,"n_rows":0,"n_cols":0,"rows_kept":0,"cut":false,"hidden":false,"merged":[]}

{"sheet":"Sheet1","index":14,"n_rows":55,"n_cols":16,"rows_kept":55,"cut":false,"hidden":true,"merged":[]}
[null,"$/100 cubic feet (ccf)","$/1000 gallons (US)","$/1000 litres",null,"Conversion table",null,null,null,null,null,null,"FROM:                                        TO:","Million gallons (US)","Megalitres (thousand cubic metres)","Acre-feet"]
["Million gallons (US)",{"$f":"1000000/(F2*100)","v":1336.8055610095364},1000,{"$f":"1000/F5","v":3785.4117999999999},null,7.4805194500000001,"gallons / cubic foot","converting FROM volume unit TO pricing UNITS",null,null,null,null,"Million gallons (US)",1,{"$f":"F4","v":3.7854117999999999},3.068883289737228]
["Megalitres (thousand cubic metres)",{"$f":"1000000/F4/(F2*100)","v":353.14666716301156},{"$f":"1000/F4","v":264.17205124155845},1000,null,43560,"sq feet / acre",null,null,null,null,null,"Megalitres (thousand cubic metres)",{"$f":"1/O2","v":0.26417205124155846},1,0.8107131936708255]
["Acre-feet",{"$f":"F3/100","v":435.6},{"$f":"F3*F2/1000","v":325.851427242},{"$f":"F3*F2*F4/1000","v":1233.4818377287083},null,3.7854117999999999,"litres / gallon",null,null,null,null,null,"Acre-feet",{"$f":"325851.427242/1000000","v":0.325851427242},1.2334818377287082,1]
[null,null,null,null,null,{"$f":"1/F4","v":0.26417205124155846},"gallons / litre"]
[]
["losses",1,"million gallons (US)",{"$f":"MATCH(C7,A2:A4,0)","v":1}]
[null,null,null,null,{"$f":"INDEX($B$2:$D$4,MATCH(C7,A2:A4,0),MATCH(C9,B1:D1,0))","v":1336.8055610095364}]
["cost",10,"$/100 cubic feet (ccf)",{"$f":"MATCH(C9,B1:D1,0)","v":1}]
[]
{"$rows_left_out":45}